LimeReport Forum
General Category | Основное => Discussion | Обсуждение => Topic started by: GraninDm on April 22, 2016, 01:18:40 pm
-
Закомментировал zint и translation
(с ними тоже ошибку выдает)
Qt 5.6.0 MinGw
Windows 7 64
xcopy /s /q /y /i Z:\Coding\qt\l_report\include\* Z:\Coding\qt\l_report\build\5.6.0\win32\release\lib\include
Скопировано файлов: 0.
Невозможно выполнить циклическое копирование
Makefile.Release:523: recipe for target '..\..\l_report\build\5.6.0\win32\release\lib\limereport.dll' failed
mingw32-make[2]: *** [..\..\l_report\build\5.6.0\win32\release\lib\limereport.dll] Error 4
mingw32-make[2]: Leaving directory 'Z:/Coding/qt/limereport-Desktop_Qt_5_6_0_MinGW_32bit/limereport'
Makefile:34: recipe for target 'release' failed
mingw32-make[1]: *** [release] Error 2
mingw32-make[1]: Leaving directory 'Z:/Coding/qt/limereport-Desktop_Qt_5_6_0_MinGW_32bit/limereport'
makefile:40: recipe for target 'sub-limereport-make_first-ordered' failed
mingw32-make: *** [sub-limereport-make_first-ordered] Error 2
13:09:25: Процесс «C:\Qt\Qt5.6.0\Tools\mingw492_32\bin\mingw32-make.exe» завершился с кодом 2.
Ошибка при сборке/установке проекта limereport (комплект: Desktop Qt 5.6.0 MinGW 32bit)
Во время выполнения этапа «Сборка»
-
А теперь компилируется.
Странно.
Но с Zint ошибка
C:/Qt/Qt5.6.0/Tools/mingw492_32/bin/../lib/gcc/i686-w64-mingw32/4.9.2/../../../../i686-w64-mingw32/bin/ld.exe: cannot find -lQtZint
collect2.exe: error: ld returned 1 exit status
Makefile.Release:529: recipe for target '..\..\l_report\build\5.6.0\win32\release\lib\limereport.dll' failed
mingw32-make[2]: *** [..\..\l_report\build\5.6.0\win32\release\lib\limereport.dll] Error 1
mingw32-make[2]: Leaving directory 'Z:/Coding/qt/limereport-Desktop_Qt_5_6_0_MinGW_32bit/limereport'
Makefile:34: recipe for target 'release' failed
mingw32-make[1]: *** [release] Error 2
mingw32-make[1]: Leaving directory 'Z:/Coding/qt/limereport-Desktop_Qt_5_6_0_MinGW_32bit/limereport'
makefile:84: recipe for target 'sub-limereport-make_first-ordered' failed
mingw32-make: *** [sub-limereport-make_first-ordered] Error 2
13:23:21: Процесс «C:\Qt\Qt5.6.0\Tools\mingw492_32\bin\mingw32-make.exe» завершился с кодом 2.
Ошибка при сборке/установке проекта limereport (комплект: Desktop Qt 5.6.0 MinGW 32bit)
Во время выполнения этапа «Сборка»
13:23:21: Прошло времени: 00:29.
-
Опять закомментировал Zint.
Опять ошибка как в первом сообщении.
Создал в каталоге .../release/lib каталог include - все заработало
-
Еще добавлю...
В demo1 не подхватываются источники данных
out of memory Error opening database
category : Invalid connection! northwind
Demo2 запускается вообще пустое окно с недоступными кнопками (список отчетов слева пуст)
-
И еще
Открыл в demo1 отчет categories увеличил масштаб до 570%
Схватил бегунок, подвинул вниз до конца, затем попытался вверх - все обрушилось.
-
ГранинДм, по поводу первых постов... там есть такая трабла, она не принципиальная, просто файлы пытаются копироваться поверх себя... просто глянь, они собрались
-
Спасибо, проверим